{"text_format":"1","workbook":"xlsx","n_sheets":7,"sheets":["Input","Fixtures League 1 & 2 ","Rules","Home team playing order","Result Sheet","Score Cards","Look up data"],"not_rendered":{"charts":0,"images":1,"macros":1,"external_links":0,"defined_names":6,"comments":0,"pivot_tables":0},"unopened":[],"bounds":{"document_bytes":16777216,"sheet_cells":100000,"rows_first":2000,"rows_last":500,"rows_between":2000,"halvings":0,"cell_chars":16384,"cell_head_chars":4096},"cells_cut":0,"cells_raw":0,"read":"whole","date_system":"1900"}

{"sheet":"Input","index":0,"n_rows":11,"n_cols":3,"rows_kept":11,"cut":false,"hidden":false,"merged":[[10,0,10,2]]}
["Please select the appropriate data in the grey cells:"]
[]
["LEAGUE",1,"   Select which division your team plays in"]
[]
["Home Team Name","Sharpness","   Select your home team name from the list"]
[]
["Fixture Date","2026-08-24","   Select date for your home fixture"]
[]
["Home Team venue",{"$f":"IF(Input!B5=\"\",\"\",VLOOKUP($B$5,'Look up data'!B2:C17,2,FALSE))","v":"Sharpness Village Hall"},"No action needed as this will populate for you"]
[]
["Press the button on the right to print the \"Result Sheet\" and \"Score Cards\""]

{"sheet":"Fixtures League 1 & 2 ","index":1,"n_rows":58,"n_cols":9,"rows_kept":58,"cut":false,"hidden":false,"merged":[]}
[null,null,null,"Home teams"]
["LEAGUE","MONTH","DATE","A","B","C","D",null,"Day"]
[1,"APRIL","2026-04-23","RIPPLE Rooks","WOTTON HALL","KINGSWAY Swans","DEFFORD Diamonds",null,{"$f":"IF(B3=\"\",\"\",C3)","v":"2026-04-23"}]
[2,"APRIL","2026-04-24","WOOLASTON Commoners","HUNTLEY Oaks","YORKLEY Falcons","YORKLEY Canaries",null,"2026-04-24"]
[1,"APRIL","2026-04-28","WOTTON HALL","DEFFORD Diamonds","SHARPNESS","WESTBURY Spitfires",null,"2026-04-28"]
[2,"APRIL","2026-04-28","YORKLEY Kestrels","WOOLASTON Commoners","WESTBURY Hurricanes","FOREST OF DEAN Squirrels",null,"2026-04-28"]
[1,"APRIL","2026-04-29","KINGSWAY Swans","WESTBURY Spitfires","KINGSWAY Cobs","RIPPLE Rooks",null,"2026-04-29"]
[1,"MAY","2026-05-06","KINGSWAY Cygnets","LONGHOPE Foxes","WOTTON HALL","RIPPLE Rooks",null,"2026-05-06"]
[2,"MAY","2026-05-12","YORKLEY Falcons","WESTBURY Hurricanes","HUNTLEY Oaks","HUNTLEY Elms",null,"2026-05-12"]
[1,"MAY","2026-05-13","WESTBURY Spitfires","KINGSWAY Cygnets","RIPPLE Rooks","WOTTON HALL",null,"2026-05-13"]
[2,"MAY","2026-05-18","FOREST OF DEAN Squirrels","WOOLASTON Commoners","YORKLEY Falcons","WOOLASTON Woodsiders",null,"2026-05-18"]
[2,"MAY","2026-05-20","WESTBURY Hurricanes","WOOLASTON Woodsiders","HUNTLEY Elms","YORKLEY Kestrels",null,"2026-05-20"]
[2,"MAY","2026-05-26","HUNTLEY Oaks","FOREST OF DEAN Squirrels","YORKLEY Kestrels","YORKLEY Canaries",null,"2026-05-26"]
[1,"MAY","2026-05-28","DEFFORD Diamonds","KINGSWAY Cygnets","SHARPNESS","LONGHOPE Foxes",null,"2026-05-28"]
[2,"JUNE","2026-06-02","YORKLEY Canaries","HUNTLEY Elms","WESTBURY Hurricanes","WOOLASTON Commoners",null,"2026-06-02"]
[1,"JUNE","2026-06-03","LONGHOPE Foxes","KINGSWAY Cobs","KINGSWAY Swans","DEFFORD Diamonds",null,"2026-06-03"]
[2,"JUNE","2026-06-09","HUNTLEY Elms","YORKLEY Falcons","YORKLEY Canaries","WESTBURY Hurricanes",null,"2026-06-09"]
[1,"JUNE","2026-06-10","KINGSWAY Cobs","SHARPNESS","LONGHOPE Foxes","KINGSWAY Swans",null,"2026-06-10"]
[2,"JUNE","2026-06-12","WOOLASTON Woodsiders","FOREST OF DEAN Squirrels","HUNTLEY Oaks","YORKLEY Kestrels",null,"2026-06-12"]
[2,"JUNE","2026-06-16","YORKLEY Kestrels","YORKLEY Falcons","HUNTLEY Elms","WOOLASTON Woodsiders",null,"2026-06-16"]
[1,"JUNE","2026-06-17","KINGSWAY Swans","WESTBURY Spitfires","LONGHOPE Foxes","SHARPNESS",null,"2026-06-17"]
[2,"JULY","2026-07-01","WESTBURY Hurricanes","YORKLEY Canaries","WOOLASTON Woodsiders","YORKLEY Falcons",null,"2026-07-01"]
[1,"JULY","2026-07-07","WOTTON HALL","KINGSWAY Cobs","DEFFORD Diamonds","KINGSWAY Cygnets",null,"2026-07-07"]
[2,"JULY","2026-07-09","YORKLEY Falcons","YORKLEY Kestrels","YORKLEY Canaries","FOREST OF DEAN Squirrels",null,"2026-07-09"]
[2,"JULY","2026-07-10","WOOLASTON Commoners","WESTBURY Hurricanes","FOREST OF DEAN Squirrels","HUNTLEY Oaks",null,"2026-07-10"]
[1,"JULY","2026-07-13","SHARPNESS","LONGHOPE Foxes","RIPPLE Rooks","WOTTON HALL",null,"2026-07-13"]
[2,"JULY","2026-07-13","FOREST OF DEAN Squirrels","HUNTLEY Oaks","WOOLASTON Commoners","HUNTLEY Elms",null,"2026-07-13"]
[1,"JULY","2026-07-15","KINGSWAY Cygnets","DEFFORD Diamonds","WESTBURY Spitfires","KINGSWAY Swans",null,"2026-07-15"]
[1,"JULY","2026-07-23","DEFFORD Diamonds","KINGSWAY Swans","WOTTON HALL","KINGSWAY Cygnets",null,"2026-07-23"]
[1,"JULY","2026-07-30","RIPPLE Rooks","SHARPNESS","WESTBURY Spitfires","KINGSWAY Cobs",null,"2026-07-30"]
{"$rows_left_out":29}
{"sheet":"Rules","index":2,"n_rows":24,"n_cols":4,"rows_kept":24,"cut":false,"hidden":false,"merged":[]}
["Summer League 2026"]
["1. Teams to consist of 4 players"]
["2. Players can play for any team but only within 1 club"]
["3. A player can play in games equal to the number of league games possible by any team (24 games)"]
["4. Teams can change players between each game during a fixture (of 3 games)"]
["5. Each fixture will have 4 teams. Playing round robin games of 7 ends – 3 games each team."]
["6. All fixtures must be played within the timescale designated by the league secretary."]
["7. Mid week fixtures should commence between 7:00 and 7:30pm (morning or afternoon games can be arranged if both teams agree)."]
["8. No trial ends."]
["9. If the jack is knocked off the mat, the non-offending team is awarded 2 shots, except on the final end, where they can choose between taking 2 shots or replaying the end."]
["10. No 3s up. Skips can visit the head at any time."]
["11. 4 points for a win, 2 for a draw"]
["12. Bonus points.  Team scoring 6 or more in a single end – 1 bonus point. Losing side losing by a single shot – 1 bonus point"]
["13. A break of around 10 minutes between games 2 and 3."]
["14. A match fee of £10 per team (£2.50 each) will be paid by all teams to the host club",null,"MAT 1  ","MAT 2"]
[null,"Game 1","team A v team B  ","team C v team D"]
["15. a) The format for an evening will be... (shown right)","Game 2  ","team B v team C  ","team D v team A"]
[null,null,"Break – 10 minutes"]
["b) The first named team will keep the scorecard, the second team will have choice of mat.","Game 3 ","team B v team D","team A v team C"]
["c) The host club will be responsible for supplying the scorecards and the result card for the fixture."]
["16. The league will be split into 2 equal divisions"]
["17. Each team will play 2 fixtures at home and 6 away (24 games)"]
["18. Teams play twice as A, B, C and D"]
["19.Eliminator, play-off, and finals will take place in September:"]

{"sheet":"Home team playing order","index":3,"n_rows":6,"n_cols":14,"rows_kept":6,"cut":false,"hidden":false,"merged":[[1,7,1,9],[1,11,1,13]]}
[]
["Game","Mat 1","Mat 2",null,"Division:",{"$f":"Input!B3","v":1},null,"Mat 1",null,null,null,"Mat 2"]
[1,"A v B","C v D",null,"Date:",{"$f":"Input!B7","v":"2026-08-24"},"Game","Home",null,"Away","Game","Home",null,"Away"]
[2,"B v C","D v A",null,null,null,1,{"$f":"VLOOKUP(Input!$B$3&Input!$B$7&Input!$B$5,'Look up data'!$H$25:$L$52,2,FALSE)","v":{"$error":"#N/A"}},"vs",{"$f":"VLOOKUP(Input!$B$3&Input!$B$7&Input!$B$5,'Look up data'!$H$25:$L$52,3,FALSE)","v":{"$error":"#N/A"}},1,{"$f":"VLOOKUP(Input!$B$3&Input!$B$7&Input!$B$5,'Look up data'!$H$25:$L$52,4,FALSE)","v":{"$error":"#N/A"}},"vs",{"$f":"VLOOKUP(Input!$B$3&Input!$B$7&Input!$B$5,'Look up data'!$H$25:$L$52,5,FALSE)","v":{"$error":"#N/A"}}]
[3,"B v D","C v A",null,null,null,2,{"$f":"J4","v":{"$error":"#N/A"}},"vs",{"$f":"L4","v":{"$error":"#N/A"}},2,{"$f":"N4","v":{"$error":"#N/A"}},"vs",{"$f":"H4","v":{"$error":"#N/A"}}]
[null,null,null,null,null,null,3,{"$f":"J4","v":{"$error":"#N/A"}},"vs",{"$f":"N4","v":{"$error":"#N/A"}},3,{"$f":"H4","v":{"$error":"#N/A"}},"vs",{"$f":"L4","v":{"$error":"#N/A"}}]

{"sheet":"Result Sheet","index":4,"n_rows":36,"n_cols":12,"rows_kept":36,"cut":false,"hidden":false,"merged":[[6,0,8,0],[10,0,12,0],[14,0,16,0],[12,7,12,9],[12,11,12,13],[14,7,14,9],[14,11,14,13],[16,7,16,9],[16,11,16,13],[6,11,6,13],[8,7,8,9],[8,11,8,13],[10,7,10,9],[10,11,10,13],[33,3,33,5],[33,7,33,13],[35,0,35,13],[0,0,0,13],[29,3,29,5],[29,7,29,13],[30,3,30,5],[30,7,30,13],[31,3,31,5],[31,7,31,13],[32,3,32,5],[32,7,32,13],[22,0,22,1],[24,0,24,1],[26,0,26,1],[28,3,28,5],[2,0,2,1],[2,7,2,13],[23,3,23,5],[24,3,24,5],[28,7,28,13],[23,7,23,13],[18,3,18,13],[24,7,24,13],[20,2,20,13],[22,3,22,5],[22,7,22,13],[21,3,21,5],[21,7,21,13],[4,7,4,9],[4,11,4,13],[6,7,6,9]]}
["SUMMER LEAGUE RESULT SHEET"]
[]
["Match Date: ",null,{"$f":"Input!B7","v":"2026-08-24"},null,null,null,"Venue: ",{"$f":"VLOOKUP(Input!B9,'Look up data'!C2:D17,1,FALSE)","v":"Sharpness Village Hall"}]
[]
["Time","Mat","Home Team","SCORE\nHOME",null,"SCORE\nAWAY","Away Team","POINTS\nHOME",null,null,null,"POINTS\nAWAY"]
[]
[{"$f":"IF($H$3=\"Kingsway Community Centre\",\"19:15\",\"19:00\")","v":"19:00"},1,{"$f":"\" Team A     \" &'Home team playing order'!H4","v":{"$error":"#N/A"}},null,null,null,{"$f":"\" Team B     \" &'Home team playing order'!J4","v":{"$error":"#N/A"}}]
[]
[null,2,{"$f":"\" Team C     \" &'Home team playing order'!L4","v":{"$error":"#N/A"}},null,null,null,{"$f":"\" Team D     \" &'Home team playing order'!N4","v":{"$error":"#N/A"}}]
[]
[{"$f":"IF($H$3=\"Kingsway Community Centre\",\"20:05\",\"19:50\")","v":"19:50"},1,{"$f":"G7","v":{"$error":"#N/A"}},null,null,null,{"$f":"C9","v":{"$error":"#N/A"}}]
[]
[null,2,{"$f":"G9","v":{"$error":"#N/A"}},null,null,null,{"$f":"C7","v":{"$error":"#N/A"}}]
[]
[{"$f":"IF($H$3=\"Kingsway Community Centre\",\"21:10\",\"20:55\")","v":"20:55"},1,{"$f":"G7","v":{"$error":"#N/A"}},null,null,null,{"$f":"G9","v":{"$error":"#N/A"}}]
[]
[null,2,{"$f":"G13","v":{"$error":"#N/A"}},null,null,null,{"$f":"G11","v":{"$error":"#N/A"}}]
[]
[null,null,null,"4 points for win, 2 points for draw, 0 points for a loss, 1 point for losing within 1 shot &/or 1 point for 6 shots on 1 end (\"hotshot\")"]
[]
[]
[null,null,{"$f":"C7","v":{"$error":"#N/A"}},{"$f":"G7","v":{"$error":"#N/A"}},null,null,{"$f":"C9","v":{"$error":"#N/A"}},{"$f":"G9","v":{"$error":"#N/A"}}]
["TOTAL POINTS"]
[]
["CAPTAINS SIGNATURE"]
[]
["PLAYERS",null,"Christian and surnames (and number of games played if less than 3)"]
[]
[]
[]
{"$rows_left_out":7}
{"sheet":"Score Cards","index":5,"n_rows":28,"n_cols":46,"rows_kept":28,"cut":false,"hidden":false,"merged":[[1,1,1,5],[1,9,1,13],[1,17,1,21],[1,25,1,29],[1,33,1,37],[1,41,1,45],[3,25,3,26],[3,28,3,29],[3,33,3,34],[3,36,3,37],[3,41,3,42],[3,44,3,45],[3,1,3,2],[3,4,3,5],[3,9,3,10],[3,12,3,13],[3,17,3,18],[3,20,3,21],[5,25,5,26],[5,28,5,29],[5,33,5,34],[5,36,5,37],[5,41,5,42],[5,44,5,45],[5,1,5,2],[5,4,5,5],[5,9,5,10],[5,12,5,13],[5,17,5,18],[5,20,5,21],[6,25,6,26],[6,28,6,29],[6,33,6,34],[6,36,6,37],[6,41,6,42],[6,44,6,45],[6,1,6,2],[6,4,6,5],[6,9,6,10],[6,12,6,13],[6,17,6,18],[6,20,6,21],[7,25,7,26],[7,28,7,29],[7,33,7,34],[7,36,7,37],[7,41,7,42],[7,44,7,45],[7,1,7,2],[7,4,7,5],[7,9,7,10],[7,12,7,13],[7,17,7,18],[7,20,7,21],[8,25,8,26],[8,28,8,29],[8,33,8,34],[8,36,8,37],[8,41,8,42],[8,44,8,45],[8,1,8,2],[8,4,8,5],[8,9,8,10],[8,12,8,13],[8,17,8,18],[8,20,8,21],[9,25,9,26],[9,28,9,29],[9,33,9,34],[9,36,9,37],[9,41,9,42],[9,44,9,45],[9,1,9,2],[9,4,9,5],[9,9,9,10],[9,12,9,13],[9,17,9,18],[9,20,9,21],[10,25,10,26],[10,28,10,29],[10,33,10,34],[10,36,10,37],[10,41,10,42],[10,44,10,45],[10,1,10,2],[10,4,10,5],[10,9,10,10],[10,12,10,13],[10,17,10,18],[10,20,10,21],[11,25,11,26],[11,28,11,29],[11,33,11,34],[11,36,11,37],[11,41,11,42],[11,44,11,45],[11,1,11,2],[11,4,11,5],[11,9,11,10],[11,12,11,13],[11,17,11,18],[11,20,11,21],[12,25,12,26],[12,28,12,29],[12,33,12,34],[12,36,12,37],[12,41,12,42],[12,44,12,45],[12,1,12,2],[12,4,12,5],[12,9,12,10],[12,12,12,13],[12,17,12,18],[12,20,12,21],[23,25,23,26],[23,28,23,29],[23,33,23,34],[23,36,23,37],[23,41,23,42],[23,44,23,45],[23,1,23,2],[23,4,23,5],[23,9,23,10],[23,12,23,13],[23,17,23,18],[23,20,23,21],[24,25,24,26],[24,28,24,29],[24,33,24,34],[24,36,24,37],[24,41,24,42],[24,44,24,45],[24,1,24,2],[24,4,24,5],[24,9,24,10],[24,12,24,13],[24,17,24,18],[24,20,24,21],[27,1,27,5],[27,9,27,13],[27,17,27,21],[27,25,27,29],[27,33,27,37],[27,41,27,45],[26,1,26,5],[26,9,26,13],[26,17,26,21],[26,25,26,29],[26,33,26,37],[26,41,26,45]]}
[]
[null,"Summer League Scorecard",null,null,null,null,null,null,null,"Summer League Scorecard",null,null,null,null,null,null,null,"Summer League Scorecard",null,null,null,null,null,null,null,"Summer League Scorecard",null,null,null,null,null,null,null,"Summer League Scorecard",null,null,null,null,null,null,null,"Summer League Scorecard"]
[]
[null,{"$f":"VLOOKUP(Input!B9,'Look up data'!C2:D17,2,FALSE)","v":"SHARPNESS"},null,null,{"$f":"'Result Sheet'!C3","v":"2026-08-24"},null,null,null,null,{"$f":"B4","v":"SHARPNESS"},null,null,{"$f":"E4","v":"2026-08-24"},null,null,null,null,{"$f":"J4","v":"SHARPNESS"},null,null,{"$f":"M4","v":"2026-08-24"},null,null,null,null,{"$f":"R4","v":"SHARPNESS"},null,null,{"$f":"U4","v":"2026-08-24"},null,null,null,null,{"$f":"Z4","v":"SHARPNESS"},null,null,{"$f":"AC4","v":"2026-08-24"},null,null,null,null,{"$f":"AH4","v":"SHARPNESS"},null,null,{"$f":"AK4","v":"2026-08-24"}]
[]
[null,"Game 1",null,null,"Mat 1",null,null,null,null,"Game 1",null,null,"Mat 2",null,null,null,null,"Game 2",null,null,"Mat 1",null,null,null,null,"Game 2",null,null,"Mat 2",null,null,null,null,"Game 3",null,null,"Mat 1",null,null,null,null,"Game 3",null,null,"Mat 2"]
[null,"Home",null,null,"Away",null,null,null,null,"Home",null,null,"Away",null,null,null,null,"Home",null,null,"Away",null,null,null,null,"Home",null,null,"Away",null,null,null,null,"Home",null,null,"Away",null,null,null,null,"Home",null,null,"Away"]
[null,{"$f":"'Home team playing order'!H4","v":{"$error":"#N/A"}},null,"vs",{"$f":"'Home team playing order'!J4","v":{"$error":"#N/A"}},null,null,null,null,{"$f":"'Home team playing order'!L4","v":{"$error":"#N/A"}},null,"vs",{"$f":"'Home team playing order'!N4","v":{"$error":"#N/A"}},null,null,null,null,{"$f":"E8","v":{"$error":"#N/A"}},null,"vs",{"$f":"J8","v":{"$error":"#N/A"}},null,null,null,null,{"$f":"M8","v":{"$error":"#N/A"}},null,"vs",{"$f":"B8","v":{"$error":"#N/A"}},null,null,null,null,{"$f":"E8","v":{"$error":"#N/A"}},null,"vs",{"$f":"M8","v":{"$error":"#N/A"}},null,null,null,null,{"$f":"J8","v":{"$error":"#N/A"}},null,"vs",{"$f":"B8","v":{"$error":"#N/A"}}]
[]
[]
[]
[]
[]
[]
[null,"Shots","Total","Ends","Shots","Total",null,null,null,"Shots","Total","Ends","Shots","Total",null,null,null,"Shots","Total","Ends","Shots","Total",null,null,null,"Shots","Total","Ends","Shots","Total",null,null,null,"Shots","Total","Ends","Shots","Total",null,null,null,"Shots","Total","Ends","Shots","Total"]
[null,null,null,1,null,null,null,null,null,null,null,1,null,null,null,null,null,null,null,1,null,null,null,null,null,null,null,1,null,null,null,null,null,null,null,1,null,null,null,null,null,null,null,1]
[null,null,null,2,null,null,null,null,null,null,null,2,null,null,null,null,null,null,null,2,null,null,null,null,null,null,null,2,null,null,null,null,null,null,null,2,null,null,null,null,null,null,null,2]
[null,null,null,3,null,null,null,null,null,null,null,3,null,null,null,null,null,null,null,3,null,null,null,null,null,null,null,3,null,null,null,null,null,null,null,3,null,null,null,null,null,null,null,3]
[null,null,null,4,null,null,null,null,null,null,null,4,null,null,null,null,null,null,null,4,null,null,null,null,null,null,null,4,null,null,null,null,null,null,null,4,null,null,null,null,null,null,null,4]
[null,null,null,5,null,null,null,null,null,null,null,5,null,null,null,null,null,null,null,5,null,null,null,null,null,null,null,5,null,null,null,null,null,null,null,5,null,null,null,null,null,null,null,5]
[null,null,null,6,null,null,null,null,null,null,null,6,null,null,null,null,null,null,null,6,null,null,null,null,null,null,null,6,null,null,null,null,null,null,null,6,null,null,null,null,null,null,null,6]
[null,null,null,7,null,null,null,null,null,null,null,7,null,null,null,null,null,null,null,7,null,null,null,null,null,null,null,7,null,null,null,null,null,null,null,7,null,null,null,null,null,null,null,7]
[null,"Total",null,null,"Total",null,null,null,null,"Total",null,null,"Total",null,null,null,null,"Total",null,null,"Total",null,null,null,null,"Total",null,null,"Total",null,null,null,null,"Total",null,null,"Total",null,null,null,null,"Total",null,null,"Total"]
[]
[null,"Signature",null,null,"Signature",null,null,null,null,"Signature",null,null,"Signature",null,null,null,null,"Signature",null,null,"Signature",null,null,null,null,"Signature",null,null,"Signature",null,null,null,null,"Signature",null,null,"Signature",null,null,null,null,"Signature",null,null,"Signature"]
[]
[null,"Please return completed scores to Mike Sparrow",null,null,null,null,null,null,null,"Please return completed scores to Mike Sparrow",null,null,null,null,null,null,null,"Please return completed scores to Mike Sparrow",null,null,null,null,null,null,null,"Please return completed scores to Mike Sparrow",null,null,null,null,null,null,null,"Please return completed scores to Mike Sparrow",null,null,null,null,null,null,null,"Please return completed scores to Mike Sparrow"]
[null,"Email: mikesparrow1946@gmail.com",null,null,null,null,null,null,null,"Email: mikesparrow1946@gmail.com",null,null,null,null,null,null,null,"Email: mikesparrow1946@gmail.com",null,null,null,null,null,null,null,"Email: mikesparrow1946@gmail.com",null,null,null,null,null,null,null,"Email: mikesparrow1946@gmail.com",null,null,null,null,null,null,null,"Email: mikesparrow1946@gmail.com"]

{"sheet":"Look up data","index":6,"n_rows":84,"n_cols":12,"rows_kept":84,"cut":false,"hidden":true,"merged":[]}
["League","Team Name","Venue","Venue Short Name"]
[1,"Defford Diamonds","Defford Village Hall","DEFFORD"]
[2,"Forest of Dean Squirrels","Berry Hill Social Club","FOREST OF DEAN"]
[2,"Huntley Oaks","Huntley Village Hall","HUNTLEY"]
[2,"Huntley Elms","Huntley Village Hall","HUNTLEY"]
[1,"Kingsway Cygnets","Kingsway Community Centre","KINGSWAY"]
[1,"Kingsway Swans","Kingsway Community Centre","KINGSWAY"]
[1,"Kingsway Cobs","Kingsway Community Centre","KINGSWAY"]
[1,"Longhope Foxes","Latchen Room","LONGHOPE"]
[1,"Ripple Rooks","Ripple Parish Hall","RIPPLE"]
[1,"Sharpness","Sharpness Village Hall","SHARPNESS"]
[2,"Westbury Hurricanes","Westbury On Severn Parish Hall","WESTBURY"]
[1,"Westbury Spitfires","Westbury On Severn Parish Hall","WESTBURY"]
[1,"Wotton Hall","Wotton Hall Social Club","WOTTON HALL"]
[2,"Yorkley Canaries","Yorkley Community Centre","YORKLEY"]
[2,"Yorkley Falcons","Yorkley Community Centre","YORKLEY"]
[2,"Yorkley Kestrels","Yorkley Community Centre","YORKLEY"]
[2,"Woolaston Woodsiders","Woolaston Memorial Hall","WOOLASTON"]
[2,"Woolaston Commoners","Woolaston Memorial Hall","WOOLASTON"]
[]
[]
[]
[null,null,null,"Home teams"]
["LEAGUE","MONTH","DATE","A","B","C","D"]
[{"$f":"'Fixtures League 1 & 2 '!A3","v":1},{"$f":"'Fixtures League 1 & 2 '!B3","v":"APRIL"},{"$f":"'Fixtures League 1 & 2 '!C3","v":"2026-04-23"},{"$f":"'Fixtures League 1 & 2 '!D3","v":"RIPPLE Rooks"},{"$f":"'Fixtures League 1 & 2 '!E3","v":"WOTTON HALL"},{"$f":"'Fixtures League 1 & 2 '!F3","v":"KINGSWAY Swans"},{"$f":"'Fixtures League 1 & 2 '!G3","v":"DEFFORD Diamonds"},{"$f":"A25&C25&D25","v":"146135RIPPLE Rooks"},{"$f":"D25","v":"RIPPLE Rooks"},{"$f":"E25","v":"WOTTON HALL"},"KINGSWAY Swans","DEFFORD Diamonds"]
[{"$f":"'Fixtures League 1 & 2 '!A4","v":2},{"$f":"'Fixtures League 1 & 2 '!B4","v":"APRIL"},{"$f":"'Fixtures League 1 & 2 '!C4","v":"2026-04-24"},{"$f":"'Fixtures League 1 & 2 '!D4","v":"WOOLASTON Commoners"},{"$f":"'Fixtures League 1 & 2 '!E4","v":"HUNTLEY Oaks"},{"$f":"'Fixtures League 1 & 2 '!F4","v":"YORKLEY Falcons"},{"$f":"'Fixtures League 1 & 2 '!G4","v":"YORKLEY Canaries"},{"$f":"A26&C26&D26","v":"246136WOOLASTON Commoners"},{"$f":"D26","v":"WOOLASTON Commoners"},{"$f":"E26","v":"HUNTLEY Oaks"},{"$f":"F26","v":"YORKLEY Falcons"},{"$f":"G26","v":"YORKLEY Canaries"}]
[{"$f":"'Fixtures League 1 & 2 '!A5","v":1},{"$f":"'Fixtures League 1 & 2 '!B5","v":"APRIL"},{"$f":"'Fixtures League 1 & 2 '!C5","v":"2026-04-28"},{"$f":"'Fixtures League 1 & 2 '!D5","v":"WOTTON HALL"},{"$f":"'Fixtures League 1 & 2 '!E5","v":"DEFFORD Diamonds"},{"$f":"'Fixtures League 1 & 2 '!F5","v":"SHARPNESS"},{"$f":"'Fixtures League 1 & 2 '!G5","v":"WESTBURY Spitfires"},"146140WOTTON HALL","WOTTON HALL","DEFFORD Diamonds","SHARPNESS","WESTBURY Spitfires"]
[{"$f":"'Fixtures League 1 & 2 '!A6","v":2},{"$f":"'Fixtures League 1 & 2 '!B6","v":"APRIL"},{"$f":"'Fixtures League 1 & 2 '!C6","v":"2026-04-28"},{"$f":"'Fixtures League 1 & 2 '!D6","v":"YORKLEY Kestrels"},{"$f":"'Fixtures League 1 & 2 '!E6","v":"WOOLASTON Commoners"},{"$f":"'Fixtures League 1 & 2 '!F6","v":"WESTBURY Hurricanes"},{"$f":"'Fixtures League 1 & 2 '!G6","v":"FOREST OF DEAN Squirrels"},"246140YORKLEY Kestrels","YORKLEY Kestrels","WOOLASTON Commoners","WESTBURY Hurricanes","FOREST OF DEAN Squirrels"]
[{"$f":"'Fixtures League 1 & 2 '!A7","v":1},{"$f":"'Fixtures League 1 & 2 '!B7","v":"APRIL"},{"$f":"'Fixtures League 1 & 2 '!C7","v":"2026-04-29"},{"$f":"'Fixtures League 1 & 2 '!D7","v":"KINGSWAY Swans"},{"$f":"'Fixtures League 1 & 2 '!E7","v":"WESTBURY Spitfires"},{"$f":"'Fixtures League 1 & 2 '!F7","v":"KINGSWAY Cobs"},{"$f":"'Fixtures League 1 & 2 '!G7","v":"RIPPLE Rooks"},"146141KINGSWAY Swans","KINGSWAY Swans","WESTBURY Spitfires","KINGSWAY Cobs","RIPPLE Rooks"]
[{"$f":"'Fixtures League 1 & 2 '!A8","v":1},{"$f":"'Fixtures League 1 & 2 '!B8","v":"MAY"},{"$f":"'Fixtures League 1 & 2 '!C8","v":"2026-05-06"},{"$f":"'Fixtures League 1 & 2 '!D8","v":"KINGSWAY Cygnets"},{"$f":"'Fixtures League 1 & 2 '!E8","v":"LONGHOPE Foxes"},{"$f":"'Fixtures League 1 & 2 '!F8","v":"WOTTON HALL"},{"$f":"'Fixtures League 1 & 2 '!G8","v":"RIPPLE Rooks"},"146148KINGSWAY Cygnets","KINGSWAY Cygnets","LONGHOPE Foxes","WOTTON HALL","RIPPLE Rooks"]
{"$rows_left_out":54}